在运行maven命令时,获得testSuitexmlFiles0具有空值

发布于 2025-02-13 19:05:36 字数 5665 浏览 0 评论 0原文

我想通过提供testng.xml作为参数化来运行MVN命令(在将来与jenkins一起集成XML文件的jenkins中)

命令

C:\Users\User\Downloads\MyProject-master04\MyStoreProject>mvn test -Dsurefire.xmlfiles=testng_smoke.xml -Durl=http://automationpractice.com/index.php

[INFO] BUILD FAILURE
[INFO] ------------------------------------------------------------------------
[INFO] Total time:  2.599 s
[INFO] Finished at: 2022-07-07T23:00:50-04:00
[INFO] ------------------------------------------------------------------------
[ERROR] Failed to execute goal org.apache.maven.plugins:maven-surefire-plugin:3.0.0-M4:test (default-test) on project MyStoreProject: Execution default-test of goal org.apache.maven.plugins:maven-surefire-plugin:3.0.0-M4:test failed: testSuiteXmlFiles0 has null value -> [Help 1]

以下是pom.xml

<project xmlns="http://maven.apache.org/POM/4.0.0"
         xmlns:xsi="http://www.w3.org/2001/XMLSchema-instance"
         xsi:schemaLocation="http://maven.apache.org/POM/4.0.0 http://maven.apache.org/xsd/maven-4.0.0.xsd">
    <modelVersion>4.0.0</modelVersion>
    <groupId>MyStoreProject</groupId>
    <artifactId>MyStoreProject</artifactId>
    <version>0.0.1-SNAPSHOT</version>
    <!--    <properties>
            <xmlFiles>testng_all.xml</xmlFiles>
        </properties>-->
    <dependencies>
        <dependency>
            <groupId>org.seleniumhq.selenium</groupId>
            <artifactId>selenium-java</artifactId>
            <version>4.1.1</version>
        </dependency>
        <dependency>
            <groupId>org.seleniumhq.selenium</groupId>
            <artifactId>selenium-chrome-driver</artifactId>
            <version>4.3.0</version>
        </dependency>
        <dependency>
            <groupId>org.testng</groupId>
            <artifactId>testng</artifactId>
            <version>7.1.0</version>
            <scope>compile</scope>
        </dependency>

        <dependency>
            <groupId>org.apache.poi</groupId>
            <artifactId>poi</artifactId>
            <version>4.1.2</version>
        </dependency>
        <dependency>
            <groupId>org.apache.poi</groupId>
            <artifactId>poi-ooxml</artifactId>
            <version>4.1.2</version>
        </dependency>
        <dependency>
            <groupId>com.aventstack</groupId>
            <artifactId>extentreports</artifactId>
            <version>4.0.9</version>
        </dependency>
        <dependency>
            <groupId>commons-io</groupId>
            <artifactId>commons-io</artifactId>
            <version>2.6</version>
        </dependency>
        <dependency>
            <groupId>log4j</groupId>
            <artifactId>log4j</artifactId>
            <version>1.2.17</version>
        </dependency>
        <dependency>
            <groupId>io.github.bonigarcia</groupId>
            <artifactId>webdrivermanager</artifactId>
            <version>4.0.0</version>
        </dependency>

    </dependencies>
    <build>
        <plugins>
            <plugin>
                <groupId>org.apache.maven.plugins</groupId>
                <artifactId>maven-compiler-plugin</artifactId>
                <version>3.8.1</version>
                <configuration>
                    <source>1.8</source>
                    <target>1.8</target>
                </configuration>
            </plugin>

            <plugin>
                <groupId>org.apache.maven.plugins</groupId>
                <artifactId>maven-release-plugin</artifactId>
                <version>3.0.0-M1</version>

            </plugin>
            <plugin>
                <groupId>org.codehaus.mojo</groupId>
                <artifactId>exec-maven-plugin</artifactId>
                <version>1.6.0</version>
            </plugin>

            <plugin>
                <groupId>org.apache.maven.plugins</groupId>
                <artifactId>maven-surefire-plugin</artifactId>
                <version>3.0.0-M4</version>
                <configuration>
                    <suiteXmlFiles>
                        <suiteXmlFile>${xmlFiles}</suiteXmlFile>
                    </suiteXmlFiles>
                    <properties>
                        <property>
                            <name>usedefaultlisteners</name>
                            <value>false</value>
                        </property>
                    </properties>
                    <systemPropertyVariables>
                        <appURL>${url}</appURL>
                    </systemPropertyVariables>
                </configuration>
            </plugin>
        </plugins>

    </build>

</project>

,也是pom.xml中的 。解决突出显示的标签

”没有成功。

i want to run the mvn command from the command line by providing the testng.xml as parameterizing ( in future integrate with jenkins with paramaterization of xml files)

Running the command like this

C:\Users\User\Downloads\MyProject-master04\MyStoreProject>mvn test -Dsurefire.xmlfiles=testng_smoke.xml -Durl=http://automationpractice.com/index.php

[INFO] BUILD FAILURE
[INFO] ------------------------------------------------------------------------
[INFO] Total time:  2.599 s
[INFO] Finished at: 2022-07-07T23:00:50-04:00
[INFO] ------------------------------------------------------------------------
[ERROR] Failed to execute goal org.apache.maven.plugins:maven-surefire-plugin:3.0.0-M4:test (default-test) on project MyStoreProject: Execution default-test of goal org.apache.maven.plugins:maven-surefire-plugin:3.0.0-M4:test failed: testSuiteXmlFiles0 has null value -> [Help 1]

Below is the pom.xml

<project xmlns="http://maven.apache.org/POM/4.0.0"
         xmlns:xsi="http://www.w3.org/2001/XMLSchema-instance"
         xsi:schemaLocation="http://maven.apache.org/POM/4.0.0 http://maven.apache.org/xsd/maven-4.0.0.xsd">
    <modelVersion>4.0.0</modelVersion>
    <groupId>MyStoreProject</groupId>
    <artifactId>MyStoreProject</artifactId>
    <version>0.0.1-SNAPSHOT</version>
    <!--    <properties>
            <xmlFiles>testng_all.xml</xmlFiles>
        </properties>-->
    <dependencies>
        <dependency>
            <groupId>org.seleniumhq.selenium</groupId>
            <artifactId>selenium-java</artifactId>
            <version>4.1.1</version>
        </dependency>
        <dependency>
            <groupId>org.seleniumhq.selenium</groupId>
            <artifactId>selenium-chrome-driver</artifactId>
            <version>4.3.0</version>
        </dependency>
        <dependency>
            <groupId>org.testng</groupId>
            <artifactId>testng</artifactId>
            <version>7.1.0</version>
            <scope>compile</scope>
        </dependency>

        <dependency>
            <groupId>org.apache.poi</groupId>
            <artifactId>poi</artifactId>
            <version>4.1.2</version>
        </dependency>
        <dependency>
            <groupId>org.apache.poi</groupId>
            <artifactId>poi-ooxml</artifactId>
            <version>4.1.2</version>
        </dependency>
        <dependency>
            <groupId>com.aventstack</groupId>
            <artifactId>extentreports</artifactId>
            <version>4.0.9</version>
        </dependency>
        <dependency>
            <groupId>commons-io</groupId>
            <artifactId>commons-io</artifactId>
            <version>2.6</version>
        </dependency>
        <dependency>
            <groupId>log4j</groupId>
            <artifactId>log4j</artifactId>
            <version>1.2.17</version>
        </dependency>
        <dependency>
            <groupId>io.github.bonigarcia</groupId>
            <artifactId>webdrivermanager</artifactId>
            <version>4.0.0</version>
        </dependency>

    </dependencies>
    <build>
        <plugins>
            <plugin>
                <groupId>org.apache.maven.plugins</groupId>
                <artifactId>maven-compiler-plugin</artifactId>
                <version>3.8.1</version>
                <configuration>
                    <source>1.8</source>
                    <target>1.8</target>
                </configuration>
            </plugin>

            <plugin>
                <groupId>org.apache.maven.plugins</groupId>
                <artifactId>maven-release-plugin</artifactId>
                <version>3.0.0-M1</version>

            </plugin>
            <plugin>
                <groupId>org.codehaus.mojo</groupId>
                <artifactId>exec-maven-plugin</artifactId>
                <version>1.6.0</version>
            </plugin>

            <plugin>
                <groupId>org.apache.maven.plugins</groupId>
                <artifactId>maven-surefire-plugin</artifactId>
                <version>3.0.0-M4</version>
                <configuration>
                    <suiteXmlFiles>
                        <suiteXmlFile>${xmlFiles}</suiteXmlFile>
                    </suiteXmlFiles>
                    <properties>
                        <property>
                            <name>usedefaultlisteners</name>
                            <value>false</value>
                        </property>
                    </properties>
                    <systemPropertyVariables>
                        <appURL>${url}</appURL>
                    </systemPropertyVariables>
                </configuration>
            </plugin>
        </plugins>

    </build>

</project>

And also in pom.xml how to resolve the highlighted tag

part of po.xml

i am struck for almost 2 days, tried all the solutions online but did not succeed.

如果你对这篇内容有疑问,欢迎到本站社区发帖提问 参与讨论,获取更多帮助,或者扫码二维码加入 Web 技术交流群。

扫码二维码加入Web技术交流群

发布评论

需要 登录 才能够评论, 你可以免费 注册 一个本站的账号。
列表为空,暂无数据
我们使用 Cookies 和其他技术来定制您的体验包括您的登录状态等。通过阅读我们的 隐私政策 了解更多相关信息。 单击 接受 或继续使用网站,即表示您同意使用 Cookies 和您的相关数据。
原文